Target
Adenosine receptor A3
Ligand
BDBM50053929
Substrate
Meas. Tech.
ChEBML_31409
Ki
0.650000±n/a nM
Citation
 Webb, TRMelman, NLvovskiy, DJi, XDJacobson, KA The utilization of a unified pharmacophore query in the discovery of new antagonists of the adenosine receptor family. Bioorg Med Chem Lett 10:31-4 (2000)  
Target
Name:
Adenosine receptor A3
Synonyms:
A3 adenosine receptor (hA3) ADORA3 | Adenosine A3 receptor (A3AR)
Type:
G Protein-Coupled Receptor (GPCR)
Mol. Mass.:
36197.32
Organism:
Homo sapiens (Human)
Description:
P0DMS8
Residue:
318
  
Inhibitor
Name:
BDBM50053929
Synonyms:
CHEMBL88147 N-(9-Chloro-2-furan-2-yl-[1,2,4]triazolo[1,5-c]quinazolin-5-yl)-N-methyl-2-phenyl-acetamide | N-(9-chloro-2-(furan-2-yl)-[1,2,4]triazolo[1,5-c]quinazolin-5-yl)-2-phenylacetamide
Type:
Small organic molecule
Emp. Form.:
C21H14ClN5O2
Mol. Mass.:
403.821
SMILES:
Clc1ccc2nc(NC(=O)Cc3ccccc3)n3nc(nc3c2c1)-c1ccco1
: