Target
Prothrombin
Ligand
BDBM50084082
Substrate
Meas. Tech.
ChEBML_208331
Ki
115±n/a nM
Citation
 Lu, TSoll, RMIllig, CRBone, RMurphy, LSpurlino, JSalemme, FRTomczuk, BE Structure-activity and crystallographic analysis of a new class of non-amide-based thrombin inhibitor. Bioorg Med Chem Lett 10:79-82 (2000)  
Target
Name:
Prothrombin
Synonyms:
Activation peptide fragment 1 Coagulation factor II Prothrombin precursor Thrombin heavy chain | Thrombin light chain
Type:
Protein
Mol. Mass.:
70029.57
Organism:
Homo sapiens (Human)
Description:
P00734
Residue:
622
  
Inhibitor
Name:
BDBM50084082
Synonyms:
3-Nitro-benzenesulfonic acid 3-(1-carbamimidoyl-piperidin-4-ylmethoxy)-5-methyl-phenyl ester | CHEMBL167884
Type:
Small organic molecule
Emp. Form.:
C20H24N4O6S
Mol. Mass.:
448.493
SMILES:
Cc1cc(OCC2CC[N+](CC2)=C(N)[NH-])cc(OS(=O)(=O)c2cccc(c2)[N+]([O-])=O)c1
: