Target
Coagulation factor X
Ligand
BDBM50066616
Substrate
Meas. Tech.
ChEMBL_49303 (CHEMBL661584)
Ki
5.6±n/a nM
Citation
 Guilford, WJShaw, KJDallas, JLKoovakkat, SLee, WLiang, ALight, DRMcCarrick, MAWhitlow, MYe, BMorrissey, MM Synthesis, characterization, and structure-activity relationships of amidine-substituted (bis)benzylidene-cycloketone olefin isomers as potent and selective factor Xa inhibitors. J Med Chem 42:5415-25 (2000)  
Target
Name:
Coagulation factor X
Synonyms:
Activated coagulation factor X (FXa) Coagulation factor X precursor F10 Factor X heavy chain Factor Xa Stuart-Prower factor
Type:
Enzyme
Mol. Mass.:
54726.60
Organism:
Homo sapiens (Human)
Description:
Residue:
488
  
Inhibitor
Name:
BDBM50066616
Synonyms:
(Z,Z)-2,7-Bis(4-amidinobenzylidine)cycloheptan-1-one CHEMBL331437
Type:
Small organic molecule
Emp. Form.:
C23H24N4O
Mol. Mass.:
372.4629
SMILES:
NC(=N)c1cccc(\C=C2\CCCC\C(=C\c3cccc(c3)C(N)=N)C2=O)c1
: