Target
Coagulation factor X
Ligand
BDBM50084192
Substrate
Meas. Tech.
ChEMBL_49303 (CHEMBL661584)
Ki
4.8±n/a nM
Citation
 Guilford, WJShaw, KJDallas, JLKoovakkat, SLee, WLiang, ALight, DRMcCarrick, MAWhitlow, MYe, BMorrissey, MM Synthesis, characterization, and structure-activity relationships of amidine-substituted (bis)benzylidene-cycloketone olefin isomers as potent and selective factor Xa inhibitors. J Med Chem 42:5415-25 (2000)  
Target
Name:
Coagulation factor X
Synonyms:
Activated coagulation factor X (FXa) Coagulation factor X precursor F10 Factor X heavy chain Factor Xa Stuart-Prower factor
Type:
Enzyme
Mol. Mass.:
54726.60
Organism:
Homo sapiens (Human)
Description:
Residue:
488
  
Inhibitor
Name:
BDBM50084192
Synonyms:
3,5-Bis-[1-(4-carbamimidoyl-phenyl)-meth-(Z)-ylidene]-4-oxo-cyclohexanecarboxylic acid methyl ester | CHEMBL151144
Type:
Small organic molecule
Emp. Form.:
C24H24N4O3
Mol. Mass.:
416.4724
SMILES:
COC(=O)C1C\C(=C\c2ccc(cc2)C(N)=N)C(=O)\C(C1)=C/c1ccc(cc1)C(N)=N
: