Target
Collagenase 3
Ligand
BDBM50084216
Substrate
Meas. Tech.
ChEMBL_106475 (CHEMBL873935)
IC50
3±n/a nM
Citation
 Cheng, MDe, BAlmstead, NGPikul, SDowty, MEDietsch, CRDunaway, CMGu, FHsieh, LCJanusz, MJTaiwo, YONatchus, MGHudlicky, TMandel, M Design, synthesis, and biological evaluation of matrix metalloproteinase inhibitors derived from a modified proline scaffold. J Med Chem 42:5426-36 (2000)  
Target
Name:
Collagenase 3
Synonyms:
MMP-13 MMP13_HUMAN Matrix metalloproteinase-13 (MMP-13) | Matrix metalloproteinase-13 (MMP13)
Type:
Enzyme
Mol. Mass.:
53808.06
Organism:
Homo sapiens (Human)
Description:
P45452
Residue:
471
  
Inhibitor
Name:
BDBM50084216
Synonyms:
(R)-4-Methoxyamino-1-(4-methoxy-benzenesulfonyl)-pyrrolidine-2-carboxylic acid hydroxyamide | CHEMBL151591
Type:
Small organic molecule
Emp. Form.:
C13H19N3O6S
Mol. Mass.:
345.371
SMILES:
CONC1C[C@@H](N(C1)S(=O)(=O)c1ccc(OC)cc1)C(=O)NO
: