Target
5-hydroxytryptamine receptor 1D
Ligand
BDBM50084959
Substrate
Meas. Tech.
ChEMBL_279 (CHEMBL884540)
IC50
>1000±n/a nM
Citation
 Liao, YBöttcher, HHarting, JGreiner, Hvan Amsterdam, CCremers, TSundell, SMärz, JRautenberg, WWikström, H New selective and potent 5-HT(1B/1D) antagonists: chemistry and pharmacological evaluation of N-piperazinylphenyl biphenylcarboxamides and biphenylsulfonamides. J Med Chem 43:517-25 (2000)  
Target
Name:
5-hydroxytryptamine receptor 1D
Synonyms:
5-HT-1D 5-HT1D 5HT1D_HUMAN HTR1DA Serotonin (5-HT) receptor | Serotonin Receptor 1D
Type:
G Protein-Coupled Receptor (GPCR)
Mol. Mass.:
41920.63
Organism:
Homo sapiens (Human)
Description:
Receptor binding assays were performed using human clone stably expressed in CHO cells.
Residue:
377
  
Inhibitor
Name:
BDBM50084959
Synonyms:
11'-Methyl-5-[[2'-methyl-4'-(5-methyl-1,2,4-oxadiazol-3-yl)biphenyl-4-yl]carbonyl]-2,3,6,7-tetrahydrospiro[furo-[2,3-f]indole-3,4'-piperidine](SB-224289) CHEMBL281350 [2'-Methyl-4'-(5-methyl-[1,2,4]oxadiazol-3-yl)-biphenyl-4-yl]-[3-(1-methyl-piperidine)-2,3,6,7-tetrahydro-1-oxa-5-aza-s-indacen-5-yl]-methanone
Type:
Small organic molecule
Emp. Form.:
C32H32N4O3
Mol. Mass.:
520.6215
SMILES:
CN1CCC2(COc3cc4CCN(C(=O)c5ccc(cc5)-c5ccc(cc5C)-c5noc(C)n5)c4cc23)CC1
: