Target
RNA-directed RNA polymerase
Ligand
BDBM50239940
Substrate
Meas. Tech.
ChEMBL_1911261 (CHEMBL4413707)
EC50
61±n/a nM
Citation
 Mengshetti, SZhou, LSari, ODe Schutter, CZhang, HCho, JHTao, SBassit, LCVerma, KDomaoal, RAEhteshami, MJiang, YOvadia, RKasthuri, MOllinger Russell, OMcBrayer, TWhitaker, TPattassery, JPascual, MLUher, LLin, BYLee, SAmblard, FCoats, SJSchinazi, RF Discovery of a Series of 2'-?-Fluoro,2'-?-bromo-ribonucleosides and Their Phosphoramidate Prodrugs as Potent Pan-Genotypic Inhibitors of Hepatitis C Virus. J Med Chem 62:1859-1874 (2019)  
Target
Name:
RNA-directed RNA polymerase
Synonyms:
Hepatitis C virus NS5B RNA-dependent RNA polymerase | NS5B protein
Type:
Protein
Mol. Mass.:
25173.95
Organism:
Hepatitis C virus
Description:
Q8JXU8
Residue:
229
  
Inhibitor
Name:
BDBM50239940
Synonyms:
CHEBI:85083 Sofosbuvir | Sovaldi
Type:
Small organic molecule
Emp. Form.:
C22H29FN3O9P
Mol. Mass.:
529.4525
SMILES:
CC(C)OC(=O)[C@H](C)N[P@](=O)(OC[C@H]1O[C@@H](n2ccc(=O)[nH]c2=O)[C@](C)(F)[C@@H]1O)Oc1ccccc1
: