Target
Adenosine receptor A3
Ligand
BDBM50085371
Substrate
Meas. Tech.
ChEMBL_31690 (CHEMBL645772)
Kd
0.820000±n/a nM
Citation
 Baraldi, PGCacciari, BRomagnoli, RVarani, KMerighi, SGessi, SBorea, PALeung, EHickey, SLSpalluto, G Synthesis and preliminary biological evaluation of [3H]-MRE 3008-F20: the first high affinity radioligand antagonist for the human A3 adenosine receptors. Bioorg Med Chem Lett 10:209-11 (2000)  
Target
Name:
Adenosine receptor A3
Synonyms:
A3 adenosine receptor (hA3) ADORA3 | Adenosine A3 receptor (A3AR)
Type:
G Protein-Coupled Receptor (GPCR)
Mol. Mass.:
36197.32
Organism:
Homo sapiens (Human)
Description:
P0DMS8
Residue:
318
  
Inhibitor
Name:
BDBM50085371
Synonyms:
1-(8-Allyl-2-furan-2-yl-8H-pyrazolo[4,3-e][1,2,4]triazolo[1,5-c]pyrimidin-5-yl)-3-(4-methoxy-phenyl)-urea | CHEMBL304726
Type:
Small organic molecule
Emp. Form.:
C21H18N8O3
Mol. Mass.:
430.4194
SMILES:
COc1ccc(NC(=O)Nc2nc3nn(CC=C)cc3c3nc(nn23)-c2ccco2)cc1
: