Target
Coagulation factor X
Ligand
BDBM50085396
Substrate
Meas. Tech.
ChEBML_48998
Ki
20±n/a nM
Citation
 Gong, YPauls, HWSpada, APCzekaj, MLiang, GChu, VColussi, DJBrown, KDGao, J Amido-(propyl and allyl)-hydroxybenzamidines: development of achiral inhibitors of factor Xa. Bioorg Med Chem Lett 10:217-21 (2000)  
Target
Name:
Coagulation factor X
Synonyms:
Activated coagulation factor X (FXa) Coagulation factor X precursor F10 Factor X heavy chain Factor Xa Stuart-Prower factor
Type:
Enzyme
Mol. Mass.:
54726.60
Organism:
Homo sapiens (Human)
Description:
Residue:
488
  
Inhibitor
Name:
BDBM50085396
Synonyms:
Biphenyl-4,4'-dicarboxylic acid 4-amide 4'-{[3-(5-carbamimidoyl-2-hydroxy-phenyl)-allyl]-amide} | CHEMBL68486
Type:
Small organic molecule
Emp. Form.:
C24H22N4O3
Mol. Mass.:
414.4565
SMILES:
NC(=N)c1ccc(O)c(\C=C\CNC(=O)c2ccc(cc2)-c2ccc(cc2)C(N)=O)c1
: