Target
Coagulation factor X
Ligand
BDBM50085394
Substrate
Meas. Tech.
ChEBML_48998
Ki
37±n/a nM
Citation
 Gong, YPauls, HWSpada, APCzekaj, MLiang, GChu, VColussi, DJBrown, KDGao, J Amido-(propyl and allyl)-hydroxybenzamidines: development of achiral inhibitors of factor Xa. Bioorg Med Chem Lett 10:217-21 (2000)  
Target
Name:
Coagulation factor X
Synonyms:
Activated coagulation factor X (FXa) Coagulation factor X precursor F10 Factor X heavy chain Factor Xa Stuart-Prower factor
Type:
Enzyme
Mol. Mass.:
54726.60
Organism:
Homo sapiens (Human)
Description:
Residue:
488
  
Inhibitor
Name:
BDBM50085394
Synonyms:
5-Pyridin-2-yl-thiophene-2-carboxylic acid [(E)-3-(5-carbamimidoyl-2-hydroxy-phenyl)-allyl]-amide | CHEMBL72350
Type:
Small organic molecule
Emp. Form.:
C20H18N4O2S
Mol. Mass.:
378.448
SMILES:
NC(=N)c1ccc(O)c(\C=C\CNC(=O)c2ccc(s2)-c2ccccn2)c1
: