Target
1-alkyl-2-acetylglycerophosphocholine esterase
Ligand
BDBM50085496
Substrate
Meas. Tech.
ChEMBL_156348 (CHEMBL761679)
IC50
3600±n/a nM
Citation
 Lucas, RUbeda, APayá, MAlves, Mdel Olmo, ELópez, JLSan Feliciano, A Synthesis and enzyme inhibitory activities of a series of lipidic diamine and aminoalcohol derivatives on cytosolic and secretory phospholipases A2. Bioorg Med Chem Lett 10:285-8 (2000)  
Target
Name:
1-alkyl-2-acetylglycerophosphocholine esterase
Synonyms:
Group VII phospholipase A2
Type:
PROTEIN
Mol. Mass.:
10362.65
Organism:
Sus scrofa
Description:
ChEMBL_17124
Residue:
92
  
Inhibitor
Name:
BDBM50085496
Synonyms:
CHEMBL89162 N1,N1-diethylhexadecane-1,2-diamine
Type:
Small organic molecule
Emp. Form.:
C20H44N2
Mol. Mass.:
312.5768
SMILES:
CCCCCCCCCCCCCCC(N)CN(CC)CC
: