Target
Bile acid receptor
Ligand
BDBM21724
Substrate
Meas. Tech.
ChEMBL_1911947 (CHEMBL4414393)
EC50
70±n/a nM
Citation
 Pollinger, JGellrich, LSchierle, SKilu, WSchmidt, JKalinowsky, LOhrndorf, JKaiser, AHeering, JProschak, EMerk, D Tuning Nuclear Receptor Selectivity of Wy14,643 towards Selective Retinoid X Receptor Modulation. J Med Chem 62:2112-2126 (2019)  
Target
Name:
Bile acid receptor
Synonyms:
BAR FXR HRR1 NR1H4_HUMAN RIP14 Retinoid X receptor-interacting protein 14 | farnesoid x receptor
Type:
Nuclear Receptor
Mol. Mass.:
55916.24
Organism:
Homo sapiens (Human)
Description:
Q96RI1
Residue:
486
  
Inhibitor
Name:
BDBM21724
Synonyms:
3-[(E)-2-(2-chloro-4-{[3-(2,6-dichlorophenyl)-5-(1-methylethyl)isoxazol-4-yl]methoxy}phenyl)ethenyl]benzoic acid CHEMBL318457 | GW-4064
Type:
Small organic molecule
Emp. Form.:
C28H22Cl3NO4
Mol. Mass.:
542.838
SMILES:
CC(C)c1onc(c1COc1ccc(\C=C\c2cccc(c2)C(O)=O)c(Cl)c1)-c1c(Cl)cccc1Cl
: