Target
Endothelin-1 receptor
Ligand
BDBM50085852
Substrate
Meas. Tech.
ChEMBL_63363 (CHEMBL676099)
IC50
70±n/a nM
Citation
 Astles, PCBrown, TJHalley, FHandscombe, CMHarris, NVMajid, TNMcCarthy, CMcLay, IMMorley, APorter, BRoach, AGSargent, CSmith, CWalsh, RJ Selective ET(A) antagonists. 5. Discovery and structure-activity relationships of phenoxyphenylacetic acid derivatives. J Med Chem 43:900-10 (2000)  
Target
Name:
Endothelin-1 receptor
Synonyms:
EDNRA_RAT Ednra Endothelin-1 receptor
Type:
Enzyme Catalytic Domain
Mol. Mass.:
48256.91
Organism:
RAT
Description:
ENDOTHELIN A EDNRA RAT::P26684
Residue:
426
  
Inhibitor
Name:
BDBM50085852
Synonyms:
CHEMBL174229 | [2-Cyano-5-(thiophen-3-ylmethoxy)-phenoxy]-phenyl-acetic acid
Type:
Small organic molecule
Emp. Form.:
C20H15NO4S
Mol. Mass.:
365.402
SMILES:
OC(=O)C(Oc1cc(OCc2ccsc2)ccc1C#N)c1ccccc1
: