Target
Endothelin-1 receptor
Ligand
BDBM50085860
Substrate
Meas. Tech.
ChEMBL_63363 (CHEMBL676099)
IC50
49±n/a nM
Citation
 Astles, PCBrown, TJHalley, FHandscombe, CMHarris, NVMajid, TNMcCarthy, CMcLay, IMMorley, APorter, BRoach, AGSargent, CSmith, CWalsh, RJ Selective ET(A) antagonists. 5. Discovery and structure-activity relationships of phenoxyphenylacetic acid derivatives. J Med Chem 43:900-10 (2000)  
Target
Name:
Endothelin-1 receptor
Synonyms:
EDNRA_RAT Ednra Endothelin-1 receptor
Type:
Enzyme Catalytic Domain
Mol. Mass.:
48256.91
Organism:
RAT
Description:
ENDOTHELIN A EDNRA RAT::P26684
Residue:
426
  
Inhibitor
Name:
BDBM50085860
Synonyms:
(5-Benzyloxy-2-cyano-phenoxy)-o-tolyl-acetic acid | CHEMBL173838
Type:
Small organic molecule
Emp. Form.:
C23H19NO4
Mol. Mass.:
373.4013
SMILES:
Cc1ccccc1C(Oc1cc(OCc2ccccc2)ccc1C#N)C(O)=O
: