Target
Sodium-dependent noradrenaline transporter
Ligand
BDBM34142
Substrate
Meas. Tech.
ChEMBL_140883 (CHEMBL748006)
Ki
>10000±n/a nM
Citation
 Glennon, RALee, MRangisetty, JBDukat, MRoth, BLSavage, JEMcBride, ARauser, LHufeisen, SLee, DK 2-Substituted tryptamines: agents with selectivity for 5-HT(6) serotonin receptors. J Med Chem 43:1011-8 (2000)  
Target
Name:
Sodium-dependent noradrenaline transporter
Synonyms:
Monoamine transporter NET Noradrenaline Transporter (NET) Norepinephrine transporter protein (NET) SLC6A2 Sodium-dependent noradrenaline transporter (NET) | Solute carrier family 6 member 2
Type:
Multi-pass membrane protein
Mol. Mass.:
69337.72
Organism:
Homo sapiens (Human)
Description:
P23975
Residue:
617
  
Inhibitor
Name:
BDBM34142
Synonyms:
2-ethyl-5-methoxy-N,N-dimethyltryptamine EDMT [2-(2-ethyl-5-methoxy-1H-indol-3-yl)ethyl]dimethylamine, 6
Type:
Small organic molecule
Emp. Form.:
C15H22N2O
Mol. Mass.:
246.348
SMILES:
CCc1[nH]c2ccc(OC)cc2c1CCN(C)C
: