Target
Adenosine receptor A1
Ligand
BDBM50086157
Substrate
Meas. Tech.
ChEMBL_29119 (CHEMBL642253)
Ki
1.1±n/a nM
Citation
 Colotta, VCatarzi, DVarano, FCecchi, LFilacchioni, GMartini, CTrincavelli, LLucacchini, A 1,2,4-Triazolo[4,3-a]quinoxalin-1-one: a versatile tool for the synthesis of potent and selective adenosine receptor antagonists. J Med Chem 43:1158-64 (2000)  
Target
Name:
Adenosine receptor A1
Synonyms:
AA1R_BOVIN ADENOSINE A1 high ADORA1 | Adenosine A1 receptor
Type:
Enzyme Catalytic Domain
Mol. Mass.:
36602.99
Organism:
BOVINE
Description:
ADENOSINE 0 BOVINE::P28190
Residue:
326
  
Inhibitor
Name:
BDBM50086157
Synonyms:
4-(cyclopentylamino)-2-(3-fluorophenyl)-[1,2,4]triazolo[4,3-a]quinoxalin-1(2H)-one CHEMBL16774
Type:
Small organic molecule
Emp. Form.:
C20H18FN5O
Mol. Mass.:
363.3882
SMILES:
Fc1cccc(c1)-n1nc2c(NC3CCCC3)nc3ccccc3n2c1=O
: