Target
Methionine aminopeptidase 2
Ligand
BDBM401307
Substrate
Meas. Tech.
ChEMBL_1914458 (CHEMBL4417041)
Ki
0.900000±n/a nM
Citation
 Heinrich, TSeenisamy, JBecker, FBlume, BBomke, JDietz, MEckert, UFriese-Hamim, MGunera, JHansen, KLeuthner, BMusil, DPfalzgraf, JRohdich, FSiegl, CSpuck, DWegener, AZenke, FT Identification of Methionine Aminopeptidase-2 (MetAP-2) Inhibitor  J Med Chem 62:11119-11134 (2019)  
Target
Name:
Methionine aminopeptidase 2
Synonyms:
Initiation factor 2-associated 67 kDa glycoprotein MAP2_HUMAN MNPEP Methionine aminopeptidase 2 (MetAP2) P67EIF2 p67
Type:
Enzyme
Mol. Mass.:
52884.45
Organism:
Homo sapiens (Human)
Description:
P50579
Residue:
478
  
Inhibitor
Name:
BDBM401307
Synonyms:
US10005756, Compound A78
Type:
Small organic molecule
Emp. Form.:
C19H16F2N4O3
Mol. Mass.:
386.3521
SMILES:
O[C@@]1(CCN(C1=O)c1cnc2[nH]ccc2c1)C(=O)NCc1cc(F)cc(F)c1
: