Target
NAD-dependent protein deacetylase sirtuin-2
Ligand
BDBM50531288
Substrate
Meas. Tech.
ChEMBL_1914794 (CHEMBL4417377)
IC50
6770±n/a nM
Citation
 Khalil, NAAhmed, EMZaher, AFEl-Zoghbi, MSSobh, EA Synthesis of certain benzothieno[3,2-d]pyrimidine derivatives as a selective SIRT2 inhibitors. Eur J Med Chem 187:0 (2020)  
Target
Name:
NAD-dependent protein deacetylase sirtuin-2
Synonyms:
NAD-Dependent Deacetylase Sirtuin-2 NAD-dependent deacetylase sirtuin 3 SIR2-like SIR2L SIR2_HUMAN Sirtuin 2 (SIRT2)
Type:
Hydrolase
Mol. Mass.:
43172.62
Organism:
Homo sapiens (Human)
Description:
Residue:
389
  
Inhibitor
Name:
BDBM50531288
Synonyms:
CHEMBL4553883
Type:
Small organic molecule
Emp. Form.:
C17H10ClN5O2S
Mol. Mass.:
383.812
SMILES:
[O-][N+](=O)c1cccc(c1)C1N2C=NNC2=Nc2c1sc1ccc(Cl)cc21
: