Target
NAD-dependent protein deacetylase sirtuin-2
Ligand
BDBM50531286
Substrate
Meas. Tech.
ChEMBL_1914794 (CHEMBL4417377)
IC50
4980±n/a nM
Citation
 Khalil, NAAhmed, EMZaher, AFEl-Zoghbi, MSSobh, EA Synthesis of certain benzothieno[3,2-d]pyrimidine derivatives as a selective SIRT2 inhibitors. Eur J Med Chem 187:0 (2020)  
Target
Name:
NAD-dependent protein deacetylase sirtuin-2
Synonyms:
NAD-Dependent Deacetylase Sirtuin-2 NAD-dependent deacetylase sirtuin 3 SIR2-like SIR2L SIR2_HUMAN Sirtuin 2 (SIRT2)
Type:
Hydrolase
Mol. Mass.:
43172.62
Organism:
Homo sapiens (Human)
Description:
Residue:
389
  
Inhibitor
Name:
BDBM50531286
Synonyms:
CHEMBL4568936
Type:
Small organic molecule
Emp. Form.:
C22H13ClN2OS2
Mol. Mass.:
420.934
SMILES:
Clc1ccc2sc3C(N4C(=O)CSC4=Nc3c2c1)c1ccc2ccccc2c1
: