Target
D(2) dopamine receptor
Ligand
BDBM50016777
Substrate
Meas. Tech.
ChEMBL_52596 (CHEMBL664743)
Ki
819.0±n/a nM
Citation
 Linnanen, TBrisander, MUnelius, LSundholm, GHacksell, UJohansson, AM Derivatives of (R)-1,11-methyleneaporphine: synthesis, structure, and interactions with G-protein coupled receptors. J Med Chem 43:1339-49 (2001)  
Target
Name:
D(2) dopamine receptor
Synonyms:
D(2) dopamine receptor DOPAMINE D2 Long DRD2 Dopamine D2 receptor Dopamine D2 receptor (D2R) Dopamine2-like | d2
Type:
Cell-surface receptors
Mol. Mass.:
50647.10
Organism:
Homo sapiens (Human)
Description:
P14416
Residue:
443
  
Inhibitor
Name:
BDBM50016777
Synonyms:
((R)-8-Hydroxy-1,2,3,4-tetrahydro-naphthalen-2-yl)-dipropyl-ammonium (R)-7-Dipropylamino-5,6,7,8-tetrahydro-naphthalen-1-ol 7-Dipropylamino-5,6,7,8-tetrahydro-naphthalen-1-ol ((R)-OH-DPAT) CHEMBL26998 | R-(+)-7-Dipropylamino-5,6,7,8-tetrahydro-naphthalen-1-ol
Type:
Small organic molecule
Emp. Form.:
C16H25NO
Mol. Mass.:
247.3758
SMILES:
CCCN(CCC)[C@@H]1CCc2cccc(O)c2C1
: