Target
Delta-type opioid receptor
Ligand
BDBM50087063
Substrate
Meas. Tech.
ChEMBL_146902 (CHEMBL751115)
Ki
0.94±n/a nM
Citation
 Darula, ZKövér, KEMonory, KBorsodi, AMakó, ERónai, ATourwé, DPéter, ATóth, G Deltorphin II analogues with 6-hydroxy-2-aminotetralin-2-carboxylic acid in position 1. J Med Chem 43:1359-66 (2001)  
Target
Name:
Delta-type opioid receptor
Synonyms:
Cytochrome P450 3A4 Delta opioid receptor Delta-type opioid receptor (DOR) OPRD_RAT Opioid receptor Opioid receptors; mu & delta Ror-a | Voltage-gated potassium channel
Type:
G Protein-Coupled Receptor (GPCR)
Mol. Mass.:
40465.04
Organism:
Rattus norvegicus (rat)
Description:
Competition binding assays were using CHO-K1 cell membranes expressing the opioid receptor.
Residue:
372
  
Inhibitor
Name:
BDBM50087063
Synonyms:
4-(2-{2-[(2-Amino-6-hydroxy-1,2,3,4-tetrahydro-naphthalene-2-carbonyl)-amino]-propionylamino}-3-phenyl-propionylamino)-4-{1-[1-(carbamoylmethyl-carbamoyl)-2-methyl-butylcarbamoyl]-2-methyl-butylcarbamoyl}-butyric acid | CHEMBL280848
Type:
Small organic molecule
Emp. Form.:
C42H60N8O10
Mol. Mass.:
836.9734
SMILES:
CC[C@H](C)[C@H](NC(=O)[C@@H](NC(=O)[C@H](CCC(O)=O)NC(=O)[C@H](Cc1ccccc1)NC(=O)[C@H](C)NC(=O)[C@]1(N)CCc2cc(O)ccc2C1)[C@@H](C)CC)C(=O)NCC(N)=O
: