Target
Mineralocorticoid receptor
Ligand
BDBM50531595
Substrate
Meas. Tech.
ChEMBL_1920445 (CHEMBL4423290)
Ki
13±n/a nM
Citation
 Granberg, KLYuan, ZQLindmark, BEdman, KKajanus, JHogner, AMalmgren, MO'Mahony, GNordqvist, ALindberg, JTångefjord, SKossenjans, MLöfberg, CBrånalt, JLiu, DSelmi, NNikitidis, GNordberg, PHayen, AAagaard, AHansson, EHermansson, MIvarsson, IJansson-Löfmark, RKarlsson, UJohansson, UWilliam-Olsson, LHartleib-Geschwindner, JBamberg, K Identification of Mineralocorticoid Receptor Modulators with Low Impact on Electrolyte Homeostasis but Maintained Organ Protection. J Med Chem 62:1385-1406 (2019)  
Target
Name:
Mineralocorticoid receptor
Synonyms:
MCR MLR NR3C2 | Nuclear receptor subfamily 3 group C member 2
Type:
Enzyme
Mol. Mass.:
107076.42
Organism:
Homo sapiens (Human)
Description:
P08235
Residue:
984
  
Inhibitor
Name:
BDBM50531595
Synonyms:
CHEMBL4452144
Type:
Small organic molecule
Emp. Form.:
C21H18F3N3O5
Mol. Mass.:
449.3799
SMILES:
CNC(=O)C[C@H]1COc2cc(ccc2N1C(=O)c1ccc2OCC(=O)Nc2c1)C(F)(F)F
: