Target
Alpha-2B adrenergic receptor
Ligand
BDBM50085682
Substrate
Meas. Tech.
ChEMBL_33504 (CHEMBL647002)
Ki
940±n/a nM
Citation
 Ross, TMJetter, MCMcDonnell, MEBoyd, REConnelly, CDMartinez, RPLewis, MACodd, EERaffa, RBReitz, AB Alpha(2) adrenoceptor agonists as potential analgesic agents. 2. Discovery of 4-(4-imidazo)-1,3-dimethyl-6,7-dihydro-thianaphthene as a high-affinity ligand for the alpha(2D) adrenergic receptor. J Med Chem 43:1423-6 (2001)  
Target
Name:
Alpha-2B adrenergic receptor
Synonyms:
ADA2B_RAT Adrenergic receptor alpha Alpha-2B adrenergic receptor Alpha-2B adrenoreceptor | adrenergic Alpha2B
Type:
Enzyme Catalytic Domain
Mol. Mass.:
50379.83
Organism:
NEONATAL RAT
Description:
adrenergic Alpha2B ADRA2B NEONATAL RAT::P19328
Residue:
453
  
Inhibitor
Name:
BDBM50085682
Synonyms:
4-(4,5-Dihydro-benzo[b]thiophen-7-yl)-1H-imidazole | CHEMBL30955
Type:
Small organic molecule
Emp. Form.:
C11H10N2S
Mol. Mass.:
202.276
SMILES:
C1Cc2ccsc2C(=C1)c1cnc[nH]1
: