Target
Alpha-1A adrenergic receptor
Ligand
BDBM50087475
Substrate
Meas. Tech.
ChEMBL_34033 (CHEMBL646286)
Ki
3.3±n/a nM
Citation
 Meyer, MDAltenbach, RJBasha, FZCarroll, WACondon, SElmore, SWKerwin, JFSippy, KBTietje, KWendt, MDHancock, AABrune, MEBuckner, SADrizin, I Structure-activity studies for a novel series of tricyclic substituted hexahydrobenz[e]isoindole alpha(1A) adrenoceptor antagonists as potential agents for the symptomatic treatment of benign prostatic hyperplasia (BPH). J Med Chem 43:1586-603 (2000)  
Target
Name:
Alpha-1A adrenergic receptor
Synonyms:
ADA1A_RAT Adra1c Alpha-1A adrenoceptor Alpha-1C adrenergic receptor | adrenergic Alpha1A
Type:
Protein
Mol. Mass.:
51620.15
Organism:
Rattus norvegicus (Rat)
Description:
P43140
Residue:
466
  
Inhibitor
Name:
BDBM50087475
Synonyms:
3-[2-(6-Methoxy-1,3,3a,4,5,9b-hexahydro-benzo[e]isoindol-2-yl)-ethyl]-2,4-dioxo-1,2,3,4-tetrahydro-benzo[4,5]thieno[3,2-d]pyrimidine-9-carbonitrile | CHEMBL289166
Type:
Small organic molecule
Emp. Form.:
C26H24N4O3S
Mol. Mass.:
472.559
SMILES:
COc1cccc2[C@@H]3CN(CCn4c(=O)[nH]c5c(sc6cccc(C#N)c56)c4=O)C[C@@H]3CCc12
: