Target
Dimer of Protein farnesyltransferase subunit beta
Ligand
BDBM50088009
Substrate
Meas. Tech.
ChEMBL_68625 (CHEMBL680675)
Ki
140±n/a nM
Citation
 Giraud, ELuttmann, CLavelle, FRiou, JFMailliet, PLaoui, A Multivariate data analysis using D-optimal designs, partial least squares, and response surface modeling: A directional approach for the analysis of farnesyltransferase inhibitors. J Med Chem 43:1807-16 (2000)  
Target
Name:
Dimer of Protein farnesyltransferase subunit beta
Synonyms:
Protein Farnesyltransferase (PFT) Chain B
Type:
Mol. Mass.:
Description:
ASSAY_ID of EBI is 51428
Components:
This complex has 3 components.
Component 1
Name:
Protein farnesyltransferase subunit beta
Synonyms:
CAAX farnesyltransferase subunit alpha FNTB FTase-alpha GGTase-I-alpha Protein farnesyl/geranylgeranyl transferase Protein farnesyltransferase subunit beta Protein farnesyltransferase/geranylgeranyltransferase type-1 subunit alpha Ras proteins prenyltransferase subunit beta | Type I protein geranyl-geranyltransferase subunit alpha
Type:
Enzyme Subunit
Mol. Mass.:
48766.02
Organism:
Homo sapiens (Human)
Description:
Protein farnesyltransferase subunit beta
Residue:
437
  
Component 2
Name:
Protein farnesyltransferase subunit beta
Synonyms:
CAAX farnesyltransferase subunit alpha FNTB FTase-alpha GGTase-I-alpha Protein farnesyl/geranylgeranyl transferase Protein farnesyltransferase subunit beta Protein farnesyltransferase/geranylgeranyltransferase type-1 subunit alpha Ras proteins prenyltransferase subunit beta | Type I protein geranyl-geranyltransferase subunit alpha
Type:
Enzyme Subunit
Mol. Mass.:
48766.02
Organism:
Homo sapiens (Human)
Description:
Protein farnesyltransferase subunit beta
Residue:
437
  
Inhibitor
Name:
BDBM50088009
Synonyms:
(+/-)-11-[2-(2-methoxyphenyl)acetyl]-1-phenyl-(1R,8R,9S,13S)-11-azatetracyclo[6.5.2.02,7.09,13]pentadeca-2,4,6-triene-9-carboxylic acid (RPR104213) CHEMBL51804 | RPR-104213
Type:
Small organic molecule
Emp. Form.:
C30H29NO4
Mol. Mass.:
467.5556
SMILES:
COc1ccccc1CC(=O)N1C[C@@H]2[C@](C1)([C@@H]1CC[C@@]2(c2ccccc2)c2ccccc12)C(O)=O
: