Target
Neutrophil collagenase
Ligand
BDBM50088118
Substrate
Meas. Tech.
ChEMBL_105807 (CHEMBL718141)
Ki
0.100000±n/a nM
Citation
 Scozzafava, ASupuran, CT Protease inhibitors: synthesis of potent bacterial collagenase and matrix metalloproteinase inhibitors incorporating N-4-nitrobenzylsulfonylglycine hydroxamate moieties. J Med Chem 43:1858-65 (2000)  
Target
Name:
Neutrophil collagenase
Synonyms:
CLG1 MMP8 Matrix metalloproteinase-8 PMNL collagenase | PMNL-CL
Type:
Enzyme
Mol. Mass.:
53413.48
Organism:
Homo sapiens (Human)
Description:
P22894
Residue:
467
  
Inhibitor
Name:
BDBM50088118
Synonyms:
2-(N-(4-nitrobenzyl)-2,3,4,5,6-pentafluorophenylsulfonamido)-N-hydroxyacetamide N-Hydroxy-2-[(4-nitro-benzyl)-pentafluorobenzenesulfonyl-amino]-acetamide
Type:
Small organic molecule
Emp. Form.:
C15H10F5N3O6S
Mol. Mass.:
455.313
SMILES:
ONC(=O)CN(Cc1ccc(cc1)[N+]([O-])=O)S(=O)(=O)c1c(F)c(F)c(F)c(F)c1F
: