Target
Beta-2 adrenergic receptor
Ligand
BDBM25756
Substrate
Meas. Tech.
ChEMBL_1923008 (CHEMBL4425964)
Kd
130±n/a nM
Citation
 Dickson, CJHornak, VVelez-Vega, CMcKay, DJReilly, JSandham, DAShaw, DFairhurst, RACharlton, SJSykes, DAPearlstein, RADuca, JS Uncoupling the Structure-Activity Relationships of ?2 Adrenergic Receptor Ligands from Membrane Binding. J Med Chem 59:5780-9 (2016)  
Target
Name:
Beta-2 adrenergic receptor
Synonyms:
ADRB2 ADRB2_HUMAN Beta-2 adrenoceptor | Beta-2 adrenoreceptor
Type:
Mol. Mass.:
46461.69
Organism:
Homo sapiens (Human)
Description:
P07550
Residue:
413
  
Inhibitor
Name:
BDBM25756
Synonyms:
(2R,3R)-2,3-dihydroxysuccinic acid;1-(isopropylamino)-3-[4-(2-methoxyethyl)phenoxy]propan-2-ol CHEMBL13 Spesicor metoprolol tartrate | {2-hydroxy-3-[4-(2-methoxyethyl)phenoxy]propyl}(propan-2-yl)amine
Type:
Small organic molecule
Emp. Form.:
C15H25NO3
Mol. Mass.:
267.3639
SMILES:
COCCc1ccc(OCC(O)CNC(C)C)cc1
: