Target
Plasminogen
Ligand
BDBM50532384
Substrate
Meas. Tech.
ChEMBL_1923121 (CHEMBL4426077)
Ki
0.560000±n/a nM
Citation
 Hinkes, SWuttke, ASaupe, SMIvanova, TWagner, SKnörlein, AHeine, AKlebe, GSteinmetzer, T Optimization of Cyclic Plasmin Inhibitors: From Benzamidines to Benzylamines. J Med Chem 59:6370-86 (2016)  
Target
Name:
Plasminogen
Synonyms:
Activation peptide PLG Plasmin Plasmin heavy chain A, short form | Plasmin light chain B
Type:
Enzyme
Mol. Mass.:
90579.18
Organism:
Homo sapiens (Human)
Description:
Residue:
810
  
Inhibitor
Name:
BDBM50532384
Synonyms:
CHEMBL4560508
Type:
Small organic molecule
Emp. Form.:
C48H53F9N8O12S
Mol. Mass.:
1137.031
SMILES:
OC(=O)C(F)(F)F.OC(=O)C(F)(F)F.OC(=O)C(F)(F)F.[H][C@]1(Cc2ccc(NC(=O)CCN3CCN(CC3)CCC(=O)Nc3ccc(C[C@@]([H])(NS(=O)(=O)c4ccccc4)C(=O)N1)cc3)cc2)C(=O)NCc1ccc(CN)cc1
: