Target
Plasminogen
Ligand
BDBM50532389
Substrate
Meas. Tech.
ChEMBL_1923119 (CHEMBL4426075)
Ki
0.150000±n/a nM
Citation
 Hinkes, SWuttke, ASaupe, SMIvanova, TWagner, SKnörlein, AHeine, AKlebe, GSteinmetzer, T Optimization of Cyclic Plasmin Inhibitors: From Benzamidines to Benzylamines. J Med Chem 59:6370-86 (2016)  
Target
Name:
Plasminogen
Synonyms:
Activation peptide PLG Plasmin Plasmin heavy chain A, short form | Plasmin light chain B
Type:
Enzyme
Mol. Mass.:
90579.18
Organism:
Homo sapiens (Human)
Description:
Residue:
810
  
Inhibitor
Name:
BDBM50532389
Synonyms:
CHEMBL4458743
Type:
Small organic molecule
Emp. Form.:
C48H59F9N10O12S
Mol. Mass.:
1171.092
SMILES:
OC(=O)C(F)(F)F.OC(=O)C(F)(F)F.OC(=O)C(F)(F)F.[H][C@]1(Cc2ccc(NC(=O)CCN3CCN(CC3)CCC(=O)Nc3ccc(C[C@]([H])(NC1=O)C(=O)NCc1ccc(cc1)C(N)=N)cc3)cc2)NS(=O)(=O)NC1CCCCC1
: