Target
Plasminogen
Ligand
BDBM50532391
Substrate
Meas. Tech.
ChEMBL_1923121 (CHEMBL4426077)
Ki
0.450000±n/a nM
Citation
 Hinkes, SWuttke, ASaupe, SMIvanova, TWagner, SKnörlein, AHeine, AKlebe, GSteinmetzer, T Optimization of Cyclic Plasmin Inhibitors: From Benzamidines to Benzylamines. J Med Chem 59:6370-86 (2016)  
Target
Name:
Plasminogen
Synonyms:
Activation peptide PLG Plasmin Plasmin heavy chain A, short form | Plasmin light chain B
Type:
Enzyme
Mol. Mass.:
90579.18
Organism:
Homo sapiens (Human)
Description:
Residue:
810
  
Inhibitor
Name:
BDBM50532391
Synonyms:
CHEMBL4591922
Type:
Small organic molecule
Emp. Form.:
C46H56F9N9O12S
Mol. Mass.:
1130.041
SMILES:
OC(=O)C(F)(F)F.OC(=O)C(F)(F)F.OC(=O)C(F)(F)F.[H][C@]1(Cc2ccc(NC(=O)CCN3CCN(CC3)CCC(=O)Nc3ccc(C[C@]([H])(NC1=O)C(=O)NCc1ccc(cc1)C(N)=N)cc3)cc2)NS(=O)(=O)CCCC
: