Target
Endothelin-1 receptor
Ligand
BDBM50532592
Substrate
Meas. Tech.
ChEMBL_1923367 (CHEMBL4426323)
IC50
0.500000±n/a nM
Citation
 Boss, CBolli, MHGatfield, J From bosentan (TracleerŪ) to macitentan (OpsumitŪ): The medicinal chemistry perspective. Bioorg Med Chem Lett 26:3381-94 (2016)  
Target
Name:
Endothelin-1 receptor
Synonyms:
EDNRA ET-A ETA-R Endothelin receptor type A hET-AR
Type:
Enzyme Catalytic Domain
Mol. Mass.:
48736.88
Organism:
Homo sapiens (Human)
Description:
P25101
Residue:
427
  
Inhibitor
Name:
BDBM50532592
Synonyms:
Fandosentan
Type:
Small organic molecule
Emp. Form.:
C25H18F3NO6S
Mol. Mass.:
517.474
SMILES:
CCc1cc(cc2OCOc12)C1=C(N(c2ccccc2C(F)(F)F)S(=O)(=O)c2ccccc12)C(O)=O
: