Target
Adenosine receptor A3
Ligand
BDBM50067096
Substrate
Meas. Tech.
ChEMBL_31844 (CHEMBL641521)
Ki
200±n/a nM
Citation
 van Muijlwijk-Koezen, JETimmerman, Hvan der Goot, HMenge, WMFrijtag Von Drabbe Künzel, Jde Groote, MIJzerman, AP Isoquinoline and quinazoline urea analogues as antagonists for the human adenosine A(3) receptor. J Med Chem 43:2227-38 (2000)  
Target
Name:
Adenosine receptor A3
Synonyms:
A3 adenosine receptor (hA3) ADORA3 | Adenosine A3 receptor (A3AR)
Type:
G Protein-Coupled Receptor (GPCR)
Mol. Mass.:
36197.32
Organism:
Homo sapiens (Human)
Description:
P0DMS8
Residue:
318
  
Inhibitor
Name:
BDBM50067096
Synonyms:
CHEMBL71053 N-(3-Pyridin-2-yl-isoquinolin-1-yl)-benzamide VUF-8507
Type:
Small organic molecule
Emp. Form.:
C21H15N3O
Mol. Mass.:
325.3633
SMILES:
O=C(Nc1nc(cc2ccccc12)-c1ccccn1)c1ccccc1
: