Target
5-hydroxytryptamine receptor 1A
Ligand
BDBM50088696
Substrate
Meas. Tech.
ChEBML_1153
Ki
0.190000±n/a nM
Citation
 Modica, MSantagati, MSantagati, ARusso, FCagnotto, AGoegan, MMennini, T High potent and selective arylpiperazine derivatives as ligands for the 5-HT1A receptor. Bioorg Med Chem Lett 10:1089-92 (2000)  
Target
Name:
5-hydroxytryptamine receptor 1A
Synonyms:
5-HT-1A 5-HT1A 5-hydroxytryptamine receptor 1A (5HT1A) 5ht1a Htr1a Serotonin 1a (5-HT1a) receptor/Adrenergic receptor alpha-1 | Serotonin receptor 1A
Type:
G Protein-Coupled Receptor (GPCR)
Mol. Mass.:
46445.29
Organism:
Rattus norvegicus (rat)
Description:
Binding assays were performed using rat hippocampal membranes.
Residue:
422
  
Inhibitor
Name:
BDBM50088696
Synonyms:
3-Amino-6-ethyl-2-{3-[4-(2-methoxy-phenyl)-piperazin-1-yl]-propylsulfanyl}-3H-thieno[2,3-d]pyrimidin-4-one | CHEMBL11900
Type:
Small organic molecule
Emp. Form.:
C22H29N5O2S2
Mol. Mass.:
459.628
SMILES:
CCc1cc2c(nc(SCCCN3CCN(CC3)c3ccccc3OC)n(N)c2=O)s1
: