Target
D(2) dopamine receptor
Ligand
BDBM50088843
Substrate
Meas. Tech.
ChEBML_59636
Ki
>1000±n/a nM
Citation
 Hanano, TAdachi, KAoki, YMorimoto, HNaka, YHisadome, MFukuda, TSumichika, H Novel phenylpiperazine derivatives as dual cytokine regulators with TNF-alpha suppressing and IL-10 augmenting activity. Bioorg Med Chem Lett 10:875-9 (2000)  
Target
Name:
D(2) dopamine receptor
Synonyms:
DOPAMINE D2 DRD2_BOVIN | Dopamine D2 receptor
Type:
Enzyme Catalytic Domain
Mol. Mass.:
50698.79
Organism:
BOVINE
Description:
P20288
Residue:
444
  
Inhibitor
Name:
BDBM50088843
Synonyms:
CHEMBL171115 | N-{4-[4-(4-Methoxy-phenyl)-piperazin-1-ylmethyl]-benzyl}-acetamide
Type:
Small organic molecule
Emp. Form.:
C21H27N3O2
Mol. Mass.:
353.458
SMILES:
COc1ccc(cc1)N1CCN(Cc2ccc(CNC(C)=O)cc2)CC1
: