Target
5-hydroxytryptamine receptor 1A
Ligand
BDBM50088843
Substrate
Meas. Tech.
ChEBML_1462
Ki
>1000±n/a nM
Citation
 Hanano, TAdachi, KAoki, YMorimoto, HNaka, YHisadome, MFukuda, TSumichika, H Novel phenylpiperazine derivatives as dual cytokine regulators with TNF-alpha suppressing and IL-10 augmenting activity. Bioorg Med Chem Lett 10:875-9 (2000)  
Target
Name:
5-hydroxytryptamine receptor 1A
Synonyms:
5-HT-1A 5-HT1A 5-hydroxytryptamine receptor 1A (5HT1A) 5ht1a Htr1a Serotonin 1a (5-HT1a) receptor/Adrenergic receptor alpha-1 | Serotonin receptor 1A
Type:
G Protein-Coupled Receptor (GPCR)
Mol. Mass.:
46445.29
Organism:
Rattus norvegicus (rat)
Description:
Binding assays were performed using rat hippocampal membranes.
Residue:
422
  
Inhibitor
Name:
BDBM50088843
Synonyms:
CHEMBL171115 | N-{4-[4-(4-Methoxy-phenyl)-piperazin-1-ylmethyl]-benzyl}-acetamide
Type:
Small organic molecule
Emp. Form.:
C21H27N3O2
Mol. Mass.:
353.458
SMILES:
COc1ccc(cc1)N1CCN(Cc2ccc(CNC(C)=O)cc2)CC1
: