Target
D(2) dopamine receptor
Ligand
BDBM50088840
Substrate
Meas. Tech.
ChEBML_59636
Ki
>1000±n/a nM
Citation
 Hanano, TAdachi, KAoki, YMorimoto, HNaka, YHisadome, MFukuda, TSumichika, H Novel phenylpiperazine derivatives as dual cytokine regulators with TNF-alpha suppressing and IL-10 augmenting activity. Bioorg Med Chem Lett 10:875-9 (2000)  
Target
Name:
D(2) dopamine receptor
Synonyms:
DOPAMINE D2 DRD2_BOVIN | Dopamine D2 receptor
Type:
Enzyme Catalytic Domain
Mol. Mass.:
50698.79
Organism:
BOVINE
Description:
P20288
Residue:
444
  
Inhibitor
Name:
BDBM50088840
Synonyms:
CHEMBL352576 | N-{4-[4-(2,4-Difluoro-phenyl)-piperazin-1-ylmethyl]-benzyl}-acetamide
Type:
Small organic molecule
Emp. Form.:
C20H23F2N3O
Mol. Mass.:
359.4129
SMILES:
CC(=O)NCc1ccc(CN2CCN(CC2)c2ccc(F)cc2F)cc1
: