Target
Phosphatidylinositol 4,5-bisphosphate 3-kinase catalytic subunit delta isoform
Ligand
BDBM358029
Substrate
Meas. Tech.
ChEMBL_1924910 (CHEMBL4427866)
IC50
4.0±n/a nM
Citation
 Bhide, RSNeels, JQin, LYRuan, ZStachura, SWeigelt, CSack, JSStefanski, KGu, XXie, JHGoldstine, CBSkala, SPedicord, DLRuepp, SDhar, TGCarter, PHSalter-Cid, LMPoss, MADavies, P Discovery and SAR of pyrrolo[2,1-f][1,2,4]triazin-4-amines as potent and selective PI3K? inhibitors. Bioorg Med Chem Lett 26:4256-60 (2016)  
Target
Name:
Phosphatidylinositol 4,5-bisphosphate 3-kinase catalytic subunit delta isoform
Synonyms:
PI3-kinase p110 subunit delta PI3-kinase subunit p110-delta PIK3CD Phosphatidylinositol 4,5-biphosphate 3-kinase catalytic subunit delta (PIK3CD) Phosphatidylinositol 4,5-bisphosphate 3-kinase 110 kDa catalytic subunit delta (PI3K delta) Phosphatidylinositol 4,5-bisphosphate 3-kinase catalytic subunit delta (PI3Kdelta) Phosphatidylinositol 4,5-bisphosphate 3-kinase catalytic subunit delta isoform (PI3K delta) Phosphatidylinositol 4,5-bisphosphate 3-kinase catalytic subunit delta isoform (PI3K-delta) Phosphatidylinositol 4,5-bisphosphate 3-kinase catalytic subunit delta isoform (PI3Kdelta)
Type:
Enzyme Subunit
Mol. Mass.:
119489.41
Organism:
Homo sapiens (Human)
Description:
O00329
Residue:
1044
  
Inhibitor
Name:
BDBM358029
Synonyms:
7-(3-(3-Morpholinooxetan-3-yl)phenyl)-5-(1-(tetrahydro-2H-pyran-4-yl)-1H-pyrazol-5-yl)pyrrolo[2,1-f][1,2,4]triazin-4-amine | US10214537, Example 98
Type:
Small organic molecule
Emp. Form.:
C27H31N7O3
Mol. Mass.:
501.5801
SMILES:
Nc1ncnn2c(cc(-c3ccnn3C3CCOCC3)c12)-c1cccc(c1)C1(COC1)N1CCOCC1
: