Target
Serine protease 1
Ligand
BDBM50088938
Substrate
Meas. Tech.
ChEBML_212533
Ki
16±n/a nM
Citation
 Zhao, ZArnaiz, DOGriedel, BSakata, SDallas, JLWhitlow, MTrinh, LPost, JLiang, AMorrissey, MMShaw, KJ Design, synthesis, and in vitro biological activity of benzimidazole based factor Xa inhibitors. Bioorg Med Chem Lett 10:963-6 (2000)  
Target
Name:
Serine protease 1
Synonyms:
Beta-Trypsin PRSS1 TRY1 TRYP1 Trypsin I
Type:
Enzyme
Mol. Mass.:
25790.52
Organism:
Bos taurus (bovine)
Description:
P00760
Residue:
246
  
Inhibitor
Name:
BDBM50088938
Synonyms:
7-{5-[1-(1-Imino-ethyl)-piperidin-4-yloxy]-2-methyl-benzoimidazol-1-ylmethyl}-naphthalene-2-carboxamidine | CHEMBL441670
Type:
Small organic molecule
Emp. Form.:
C27H30N6O
Mol. Mass.:
454.5667
SMILES:
CC(=N)N1CCC(CC1)Oc1ccc2n(Cc3ccc4ccc(cc4c3)C(N)=N)c(C)nc2c1
: