Target
Serine protease 1
Ligand
BDBM50088957
Substrate
Meas. Tech.
ChEBML_212533
Ki
17±n/a nM
Citation
 Zhao, ZArnaiz, DOGriedel, BSakata, SDallas, JLWhitlow, MTrinh, LPost, JLiang, AMorrissey, MMShaw, KJ Design, synthesis, and in vitro biological activity of benzimidazole based factor Xa inhibitors. Bioorg Med Chem Lett 10:963-6 (2000)  
Target
Name:
Serine protease 1
Synonyms:
Beta-Trypsin PRSS1 TRY1 TRYP1 Trypsin I
Type:
Enzyme
Mol. Mass.:
25790.52
Organism:
Bos taurus (bovine)
Description:
P00760
Residue:
246
  
Inhibitor
Name:
BDBM50088957
Synonyms:
7-{2-Ethyl-5-[1-(1-imino-ethyl)-piperidin-4-yloxy]-benzoimidazol-1-ylmethyl}-naphthalene-2-carboxamidine | CHEMBL24907
Type:
Small organic molecule
Emp. Form.:
C28H32N6O
Mol. Mass.:
468.5933
SMILES:
CCc1nc2cc(OC3CCN(CC3)C(C)=N)ccc2n1Cc1ccc2ccc(cc2c1)C(N)=N
: