Target
Coagulation factor X
Ligand
BDBM50088938
Substrate
Meas. Tech.
ChEBML_48831
Ki
6.2±n/a nM
Citation
 Zhao, ZArnaiz, DOGriedel, BSakata, SDallas, JLWhitlow, MTrinh, LPost, JLiang, AMorrissey, MMShaw, KJ Design, synthesis, and in vitro biological activity of benzimidazole based factor Xa inhibitors. Bioorg Med Chem Lett 10:963-6 (2000)  
Target
Name:
Coagulation factor X
Synonyms:
Activated coagulation factor X (FXa) Coagulation factor X precursor F10 Factor X heavy chain Factor Xa Stuart-Prower factor
Type:
Enzyme
Mol. Mass.:
54726.60
Organism:
Homo sapiens (Human)
Description:
Residue:
488
  
Inhibitor
Name:
BDBM50088938
Synonyms:
7-{5-[1-(1-Imino-ethyl)-piperidin-4-yloxy]-2-methyl-benzoimidazol-1-ylmethyl}-naphthalene-2-carboxamidine | CHEMBL441670
Type:
Small organic molecule
Emp. Form.:
C27H30N6O
Mol. Mass.:
454.5667
SMILES:
CC(=N)N1CCC(CC1)Oc1ccc2n(Cc3ccc4ccc(cc4c3)C(N)=N)c(C)nc2c1
: