Target
Coagulation factor X
Ligand
BDBM50088945
Substrate
Meas. Tech.
ChEBML_48831
Ki
4.5±n/a nM
Citation
 Zhao, ZArnaiz, DOGriedel, BSakata, SDallas, JLWhitlow, MTrinh, LPost, JLiang, AMorrissey, MMShaw, KJ Design, synthesis, and in vitro biological activity of benzimidazole based factor Xa inhibitors. Bioorg Med Chem Lett 10:963-6 (2000)  
Target
Name:
Coagulation factor X
Synonyms:
Activated coagulation factor X (FXa) Coagulation factor X precursor F10 Factor X heavy chain Factor Xa Stuart-Prower factor
Type:
Enzyme
Mol. Mass.:
54726.60
Organism:
Homo sapiens (Human)
Description:
Residue:
488
  
Inhibitor
Name:
BDBM50088945
Synonyms:
7-{5-[1-(1-Imino-ethyl)-piperidin-4-yloxy]-2-propyl-benzoimidazol-1-ylmethyl}-naphthalene-2-carboxamidine | CHEMBL369161
Type:
Small organic molecule
Emp. Form.:
C29H34N6O
Mol. Mass.:
482.6199
SMILES:
CCCc1nc2cc(OC3CCN(CC3)C(C)=N)ccc2n1Cc1ccc2ccc(cc2c1)C(N)=N
: