Target
Coagulation factor X
Ligand
BDBM50088948
Substrate
Meas. Tech.
ChEBML_48831
Ki
417±n/a nM
Citation
 Zhao, ZArnaiz, DOGriedel, BSakata, SDallas, JLWhitlow, MTrinh, LPost, JLiang, AMorrissey, MMShaw, KJ Design, synthesis, and in vitro biological activity of benzimidazole based factor Xa inhibitors. Bioorg Med Chem Lett 10:963-6 (2000)  
Target
Name:
Coagulation factor X
Synonyms:
Activated coagulation factor X (FXa) Coagulation factor X precursor F10 Factor X heavy chain Factor Xa Stuart-Prower factor
Type:
Enzyme
Mol. Mass.:
54726.60
Organism:
Homo sapiens (Human)
Description:
Residue:
488
  
Inhibitor
Name:
BDBM50088948
Synonyms:
CHEMBL172831 | N-[3-(7-Carbamimidoyl-naphthalen-2-ylmethyl)-2-methyl-3H-benzoimidazol-5-yl]-N-[1-(1-imino-ethyl)-piperidin-4-yl]-succinamic acid
Type:
Small organic molecule
Emp. Form.:
C31H35N7O3
Mol. Mass.:
553.6547
SMILES:
CC(=N)N1CCC(CC1)N(C(=O)CCC(O)=O)c1ccc2nc(C)n(Cc3ccc4ccc(cc4c3)C(N)=N)c2c1
: