Target
Coagulation factor X
Ligand
BDBM50088954
Substrate
Meas. Tech.
ChEBML_48831
Ki
0.120000±n/a nM
Citation
 Zhao, ZArnaiz, DOGriedel, BSakata, SDallas, JLWhitlow, MTrinh, LPost, JLiang, AMorrissey, MMShaw, KJ Design, synthesis, and in vitro biological activity of benzimidazole based factor Xa inhibitors. Bioorg Med Chem Lett 10:963-6 (2000)  
Target
Name:
Coagulation factor X
Synonyms:
Activated coagulation factor X (FXa) Coagulation factor X precursor F10 Factor X heavy chain Factor Xa Stuart-Prower factor
Type:
Enzyme
Mol. Mass.:
54726.60
Organism:
Homo sapiens (Human)
Description:
Residue:
488
  
Inhibitor
Name:
BDBM50088954
Synonyms:
7-{2-sec-Butyl-6-[1-(1-imino-ethyl)-piperidin-4-yloxy]-benzoimidazol-1-ylmethyl}-naphthalene-2-carboxamidine | CHEMBL369165
Type:
Small organic molecule
Emp. Form.:
C30H36N6O
Mol. Mass.:
496.6464
SMILES:
CCC(C)c1nc2ccc(OC3CCN(CC3)C(C)=N)cc2n1Cc1ccc2ccc(cc2c1)C(N)=N
: