Target
Prothrombin
Ligand
BDBM50088960
Substrate
Meas. Tech.
ChEBML_48302
Ki
810±n/a nM
Citation
 Zhao, ZArnaiz, DOGriedel, BSakata, SDallas, JLWhitlow, MTrinh, LPost, JLiang, AMorrissey, MMShaw, KJ Design, synthesis, and in vitro biological activity of benzimidazole based factor Xa inhibitors. Bioorg Med Chem Lett 10:963-6 (2000)  
Target
Name:
Prothrombin
Synonyms:
Activation peptide fragment 1 Coagulation factor II Prothrombin precursor Thrombin heavy chain | Thrombin light chain
Type:
Protein
Mol. Mass.:
70029.57
Organism:
Homo sapiens (Human)
Description:
P00734
Residue:
622
  
Inhibitor
Name:
BDBM50088960
Synonyms:
7-{6-[1-(1-Imino-ethyl)-piperidin-4-yloxy]-benzoimidazol-1-ylmethyl}-naphthalene-2-carboxamidine | CHEMBL176636
Type:
Small organic molecule
Emp. Form.:
C26H28N6O
Mol. Mass.:
440.5401
SMILES:
CC(=N)N1CCC(CC1)Oc1ccc2ncn(Cc3ccc4ccc(cc4c3)C(N)=N)c2c1
: