Target
Toll-like receptor 8
Ligand
BDBM50533637
Substrate
Meas. Tech.
ChEMBL_1926130 (CHEMBL4429202)
EC50
9260±n/a nM
Citation
 Beesu, MSalyer, ACTrautman, KLHill, JKDavid, SA Human Toll-like Receptor (TLR) 8-Specific Agonistic Activity in Substituted Pyrimidine-2,4-diamines. J Med Chem 59:8082-93 (2016)  
Target
Name:
Toll-like receptor 8
Synonyms:
CD_antigen: CD288 TLR8_HUMAN | TRL8
Type:
Enzyme
Mol. Mass.:
119828.77
Organism:
Homo sapiens (Human)
Description:
Q9NR97
Residue:
1041
  
Inhibitor
Name:
BDBM50533637
Synonyms:
CHEMBL4522643
Type:
Small organic molecule
Emp. Form.:
C13H27Cl2N5
Mol. Mass.:
324.293
SMILES:
Cl.Cl.CCCCNc1nc(N)nc(C)c1CCCCN
: