Target
Toll-like receptor 8
Ligand
BDBM50533638
Substrate
Meas. Tech.
ChEMBL_1926123 (CHEMBL4429195)
EC50
2700±n/a nM
Citation
 Beesu, MSalyer, ACTrautman, KLHill, JKDavid, SA Human Toll-like Receptor (TLR) 8-Specific Agonistic Activity in Substituted Pyrimidine-2,4-diamines. J Med Chem 59:8082-93 (2016)  
Target
Name:
Toll-like receptor 8
Synonyms:
CD_antigen: CD288 TLR8_HUMAN | TRL8
Type:
Enzyme
Mol. Mass.:
119828.77
Organism:
Homo sapiens (Human)
Description:
Q9NR97
Residue:
1041
  
Inhibitor
Name:
BDBM50533638
Synonyms:
CHEMBL4540822
Type:
Small organic molecule
Emp. Form.:
C18H29Cl2N5
Mol. Mass.:
386.362
SMILES:
Cl.Cl.CCCCNc1nc(N)nc(c1CCCCN)-c1ccccc1
: