Target
B2 bradykinin receptor
Ligand
BDBM50089306
Substrate
Meas. Tech.
ChEMBL_40428 (CHEMBL652643)
Ki
>10±n/a nM
Citation
 Amblard, MBedos, POlivier, CDaffix, ILuccarini, JMDodey, PPruneau, DPaquet, JLMartinez, J Synthesis and biological evaluation of bradykinin B(1)/B(2) and selective B(1) receptor antagonists. J Med Chem 43:2382-6 (2000)  
Target
Name:
B2 bradykinin receptor
Synonyms:
B2 BRADYKININ B2R BK-2 receptor BKRB2_HUMAN | Bradykinin B2 receptor
Type:
Enzyme Catalytic Domain
Mol. Mass.:
44467.17
Organism:
Homo sapiens (Human)
Description:
B2 BRADYKININ BDKRB2 HUMAN::P30411
Residue:
391
  
Inhibitor
Name:
BDBM50089306
Synonyms:
2-{[1-(2-{2-[2-({1-[1-(2-Amino-5-guanidino-pentanoyl)-pyrrolidine-2-carbonyl]-pyrrolidine-2-carbonyl}-amino)-acetylamino]-3-phenyl-propionylamino}-3-hydroxy-propionyl)-pyrrolidine-2-carbonyl]-amino}-4-methyl-pentanoic acid | CHEMBL80472
Type:
Small organic molecule
Emp. Form.:
C41H63N11O10
Mol. Mass.:
870.0066
SMILES:
CC(C)C[C@H](NC(=O)[C@@H]1CCCN1C(=O)[C@H](CO)NC(=O)[C@H](Cc1ccccc1)NC(=O)CNC(=O)[C@@H]1CCCN1C(=O)[C@@H]1CCCN1C(=O)[C@@H](N)CCCNC(N)=N)C(O)=O
: