Target
Mu-type opioid receptor
Ligand
BDBM50528969
Substrate
Meas. Tech.
ChEMBL_1926742 (CHEMBL4429814)
EC50
1.4±n/a nM
Citation
 Váradi, AMarrone, GFPalmer, TCNarayan, ASzabó, MRLe Rouzic, VGrinnell, SGSubrath, JJWarner, EKalra, SHunkele, APagirsky, JEans, SOMedina, JMXu, JPan, YXBorics, APasternak, GWMcLaughlin, JPMajumdar, S Mitragynine/Corynantheidine Pseudoindoxyls As Opioid Analgesics with Mu Agonism and Delta Antagonism, Which Do Not Recruit ?-Arrestin-2. J Med Chem 59:8381-97 (2016)  
Target
Name:
Mu-type opioid receptor
Synonyms:
M-OR-1 Mor OPRM_MOUSE Oprm | Oprm1
Type:
Enzyme Catalytic Domain
Mol. Mass.:
44431.62
Organism:
MOUSE
Description:
OPIATE Mu OPRM1 MOUSE::P42866
Residue:
398
  
Inhibitor
Name:
BDBM50528969
Synonyms:
CHEMBL4458337
Type:
Small organic molecule
Emp. Form.:
C28H32N2O4
Mol. Mass.:
460.5647
SMILES:
[H][C@@]12C[C@@H]([C@H](CC)CN1CC[C@]21Nc2cccc(c2C1=O)-c1ccccc1)C(=C/OC)\C(=O)OC
: