Target
Adenosine kinase
Ligand
BDBM50375654
Substrate
Meas. Tech.
ChEMBL_1927383 (CHEMBL4430455)
Ki
26±n/a nM
Citation
 Köse, MSchiedel, ACBauer, AAPoschenrieder, HBurbiel, JCAkkinepally, RRStachel, HDMüller, CE Focused screening to identify new adenosine kinase inhibitors. Bioorg Med Chem 24:5127-5133 (2016)  
Target
Name:
Adenosine kinase
Synonyms:
ADK | ADK_HUMAN
Type:
PROTEIN
Mol. Mass.:
40545.97
Organism:
Homo sapiens (Human)
Description:
ChEMBL_1467841
Residue:
362
  
Inhibitor
Name:
BDBM50375654
Synonyms:
CHEMBL99203 | US11633415, Compound 5-iodotubercidin
Type:
Small organic molecule
Emp. Form.:
C11H13IN4O4
Mol. Mass.:
392.1498
SMILES:
Nc1ncnc2n(cc(I)c12)[C@@H]1O[C@H](CO)[C@@H](O)[C@H]1O
: