Target
Alpha-1B adrenergic receptor
Ligand
BDBM50090017
Substrate
Meas. Tech.
ChEMBL_34327 (CHEMBL648110)
Ki
120±n/a nM
Citation
 Barrow, JCNantermet, PGSelnick, HGGlass, KLRittle, KEGilbert, KFSteele, TGHomnick, CFFreidinger, RMRansom, RWKling, PReiss, DBroten, TPSchorn, TWChang, RSO'Malley, SSOlah, TVEllis, JDBarrish, AKassahun, KLeppert, PNagarathnam, DForray, C In vitro and in vivo evaluation of dihydropyrimidinone C-5 amides as potent and selective alpha(1A) receptor antagonists for the treatment of benign prostatic hyperplasia. J Med Chem 43:2703-18 (2000)  
Target
Name:
Alpha-1B adrenergic receptor
Synonyms:
ADA1B_HUMAN Adrenergic alpha1B Adrenergic receptor alpha Alpha 1B-adrenoreceptor | Alpha-1B adrenergic receptor
Type:
Enzyme
Mol. Mass.:
56862.13
Organism:
Homo sapiens (Human)
Description:
P35368
Residue:
520
  
Inhibitor
Name:
BDBM50090017
Synonyms:
(R)-4-(3,4-Difluoro-phenyl)-1,6-dimethyl-2-oxo-1,2,3,4-tetrahydro-pyrimidine-5-carboxylic acid {3-[4-(4-fluoro-phenyl)-piperidin-1-yl]-propyl}-amide | CHEMBL90421
Type:
Small organic molecule
Emp. Form.:
C27H31F3N4O2
Mol. Mass.:
500.5558
SMILES:
CN1C(=O)N[C@@H](C(C(=O)NCCCN2CCC(CC2)c2ccc(F)cc2)=C1C)c1ccc(F)c(F)c1
: